{"text_format":"1","workbook":"xlsx","n_sheets":3,"sheets":["Lookup","Anesthesia Fee Schedule","Ref"],"not_rendered":{"charts":0,"images":3,"macros":1,"external_links":0,"defined_names":2,"comments":0,"pivot_tables":0},"unopened":[],"bounds":{"document_bytes":16777216,"sheet_cells":100000,"rows_first":2000,"rows_last":500,"rows_between":2000,"halvings":0,"cell_chars":16384,"cell_head_chars":4096},"cells_cut":0,"cells_raw":0,"read":"whole","date_system":"1900"}

{"sheet":"Lookup","index":0,"n_rows":6,"n_cols":10,"rows_kept":6,"cut":false,"hidden":false,"merged":[[0,0,0,8],[1,8,1,9],[3,3,3,8]]}
["Code Lookup Tool (Anesthesia Fee Schedule)"]
[null,null,null,"Code","Anesthesia Value","Payment Method","Base Source","FSI","Prior Auth"]
["Enter code -->",922,1,{"$f":"VLOOKUP(C3,Ref!A4:G271,{2,3,4,5,6,7},)","v":922},6,"Base/Time","CMS","A",0,922]
[null,null,null,"NOTE: The MARFS chapters linked below are recommended for your understanding of these codes but are not to be considered explicit context and do not remove your responsibility to bill properly in accordance with the L&I Provider Agreement, applicable RCWs and WACs, and the MARFS in its entirety."]
[null,null,null,"Chapter 2: Information for All Providers"]
[null,null,null,"Chapter 4: Anesthesia Services"]

{"sheet":"Anesthesia Fee Schedule","index":1,"n_rows":372,"n_cols":9,"rows_kept":372,"cut":false,"hidden":false,"merged":[[102,3,102,5],[14,0,14,11],[86,7,86,11],[87,7,87,11],[88,7,88,11],[89,7,89,11],[20,0,20,11],[93,2,95,4],[84,2,84,4],[93,5,93,6],[90,7,90,11],[18,0,18,11],[83,2,83,4],[85,0,88,1],[94,5,94,6],[91,7,91,11],[83,5,83,6],[83,0,83,1],[82,0,82,11],[85,2,88,4],[92,5,92,6],[91,5,91,6],[83,7,83,11],[84,5,84,6],[85,5,85,6],[87,5,87,6],[88,5,88,6],[89,5,89,6],[86,5,86,6],[22,1,26,3],[96,0,100,1],[96,2,100,4],[92,7,92,11],[93,7,93,11],[94,7,94,11],[84,0,84,1],[97,5,97,6],[95,7,95,11],[89,0,92,1],[89,2,92,4],[90,5,90,6],[93,0,95,1],[95,5,95,6],[84,7,84,11],[85,7,85,11],[100,5,100,6],[96,7,96,11],[98,7,98,11],[99,7,99,11],[100,7,100,11],[98,5,98,6],[97,7,97,11],[96,5,96,6],[99,5,99,6]]}
[]
[]
[]
[]
[]
[]
[]
[]
[]
[]
[]
[]
[]
[]
["Anesthesia Services Fee Schedule"]
[]
[]
[]
["Effective for Dates of Service on or After"]
[]
["2021-07-01"]
[]
[null,"To Skip The Keys\n&\nGo To The Fees\nClick Here"]
[]
[]
[]
[]
[]
[]
[]
[]
[]
[]
[]
[]
[]
[]
[]
[]
[]
[]
[]
[]
[]
[]
[]
[]
[]
[]
[]
[]
[]
[]
[]
[]
[]
[]
[]
[]
[]
{"$rows_left_out":313}
{"sheet":"Ref","index":2,"n_rows":271,"n_cols":7,"rows_kept":271,"cut":false,"hidden":true,"merged":[]}
[]
[]
[]
[{"$f":"SEARCH(Lookup!$J$3,B4)","v":{"$error":"#VALUE!"}},{"$f":"'Anesthesia Fee Schedule'!D105","v":100},{"$f":"'Anesthesia Fee Schedule'!E105","v":5},{"$f":"'Anesthesia Fee Schedule'!F105","v":"Base/Time"},{"$f":"'Anesthesia Fee Schedule'!G105","v":"CMS"},{"$f":"'Anesthesia Fee Schedule'!H105","v":"A"},{"$f":"'Anesthesia Fee Schedule'!I105","v":0}]
[{"$f":"SEARCH(Lookup!$J$3,B5)","v":{"$error":"#VALUE!"}},{"$f":"'Anesthesia Fee Schedule'!D106","v":102},{"$f":"'Anesthesia Fee Schedule'!E106","v":6},{"$f":"'Anesthesia Fee Schedule'!F106","v":"Base/Time"},{"$f":"'Anesthesia Fee Schedule'!G106","v":"CMS"},{"$f":"'Anesthesia Fee Schedule'!H106","v":"A"},{"$f":"'Anesthesia Fee Schedule'!I106","v":0}]
[{"$f":"SEARCH(Lookup!$J$3,B6)","v":{"$error":"#VALUE!"}},{"$f":"'Anesthesia Fee Schedule'!D107","v":103},{"$f":"'Anesthesia Fee Schedule'!E107","v":5},{"$f":"'Anesthesia Fee Schedule'!F107","v":"Base/Time"},{"$f":"'Anesthesia Fee Schedule'!G107","v":"CMS"},{"$f":"'Anesthesia Fee Schedule'!H107","v":"A"},{"$f":"'Anesthesia Fee Schedule'!I107","v":0}]
[{"$f":"SEARCH(Lookup!$J$3,B7)","v":{"$error":"#VALUE!"}},{"$f":"'Anesthesia Fee Schedule'!D108","v":104},{"$f":"'Anesthesia Fee Schedule'!E108","v":4},{"$f":"'Anesthesia Fee Schedule'!F108","v":"Base/Time"},{"$f":"'Anesthesia Fee Schedule'!G108","v":"CMS"},{"$f":"'Anesthesia Fee Schedule'!H108","v":"A"},{"$f":"'Anesthesia Fee Schedule'!I108","v":0}]
[{"$f":"SEARCH(Lookup!$J$3,B8)","v":{"$error":"#VALUE!"}},{"$f":"'Anesthesia Fee Schedule'!D109","v":120},{"$f":"'Anesthesia Fee Schedule'!E109","v":5},{"$f":"'Anesthesia Fee Schedule'!F109","v":"Base/Time"},{"$f":"'Anesthesia Fee Schedule'!G109","v":"CMS"},{"$f":"'Anesthesia Fee Schedule'!H109","v":"A"},{"$f":"'Anesthesia Fee Schedule'!I109","v":0}]
[{"$f":"SEARCH(Lookup!$J$3,B9)","v":{"$error":"#VALUE!"}},{"$f":"'Anesthesia Fee Schedule'!D110","v":124},{"$f":"'Anesthesia Fee Schedule'!E110","v":4},{"$f":"'Anesthesia Fee Schedule'!F110","v":"Base/Time"},{"$f":"'Anesthesia Fee Schedule'!G110","v":"CMS"},{"$f":"'Anesthesia Fee Schedule'!H110","v":"A"},{"$f":"'Anesthesia Fee Schedule'!I110","v":0}]
[{"$f":"SEARCH(Lookup!$J$3,B10)","v":{"$error":"#VALUE!"}},{"$f":"'Anesthesia Fee Schedule'!D111","v":126},{"$f":"'Anesthesia Fee Schedule'!E111","v":4},{"$f":"'Anesthesia Fee Schedule'!F111","v":"Base/Time"},{"$f":"'Anesthesia Fee Schedule'!G111","v":"CMS"},{"$f":"'Anesthesia Fee Schedule'!H111","v":"A"},{"$f":"'Anesthesia Fee Schedule'!I111","v":0}]
[{"$f":"SEARCH(Lookup!$J$3,B11)","v":{"$error":"#VALUE!"}},{"$f":"'Anesthesia Fee Schedule'!D112","v":140},{"$f":"'Anesthesia Fee Schedule'!E112","v":5},{"$f":"'Anesthesia Fee Schedule'!F112","v":"Base/Time"},{"$f":"'Anesthesia Fee Schedule'!G112","v":"CMS"},{"$f":"'Anesthesia Fee Schedule'!H112","v":"A"},{"$f":"'Anesthesia Fee Schedule'!I112","v":0}]
[{"$f":"SEARCH(Lookup!$J$3,B12)","v":{"$error":"#VALUE!"}},{"$f":"'Anesthesia Fee Schedule'!D113","v":142},{"$f":"'Anesthesia Fee Schedule'!E113","v":4},{"$f":"'Anesthesia Fee Schedule'!F113","v":"Base/Time"},{"$f":"'Anesthesia Fee Schedule'!G113","v":"CMS"},{"$f":"'Anesthesia Fee Schedule'!H113","v":"A"},{"$f":"'Anesthesia Fee Schedule'!I113","v":0}]
[{"$f":"SEARCH(Lookup!$J$3,B13)","v":{"$error":"#VALUE!"}},{"$f":"'Anesthesia Fee Schedule'!D114","v":144},{"$f":"'Anesthesia Fee Schedule'!E114","v":6},{"$f":"'Anesthesia Fee Schedule'!F114","v":"Base/Time"},{"$f":"'Anesthesia Fee Schedule'!G114","v":"CMS"},{"$f":"'Anesthesia Fee Schedule'!H114","v":"A"},{"$f":"'Anesthesia Fee Schedule'!I114","v":0}]
[{"$f":"SEARCH(Lookup!$J$3,B14)","v":{"$error":"#VALUE!"}},{"$f":"'Anesthesia Fee Schedule'!D115","v":145},{"$f":"'Anesthesia Fee Schedule'!E115","v":6},{"$f":"'Anesthesia Fee Schedule'!F115","v":"Base/Time"},{"$f":"'Anesthesia Fee Schedule'!G115","v":"CMS"},{"$f":"'Anesthesia Fee Schedule'!H115","v":"A"},{"$f":"'Anesthesia Fee Schedule'!I115","v":0}]
[{"$f":"SEARCH(Lookup!$J$3,B15)","v":{"$error":"#VALUE!"}},{"$f":"'Anesthesia Fee Schedule'!D116","v":147},{"$f":"'Anesthesia Fee Schedule'!E116","v":4},{"$f":"'Anesthesia Fee Schedule'!F116","v":"Base/Time"},{"$f":"'Anesthesia Fee Schedule'!G116","v":"CMS"},{"$f":"'Anesthesia Fee Schedule'!H116","v":"A"},{"$f":"'Anesthesia Fee Schedule'!I116","v":0}]
[{"$f":"SEARCH(Lookup!$J$3,B16)","v":{"$error":"#VALUE!"}},{"$f":"'Anesthesia Fee Schedule'!D117","v":148},{"$f":"'Anesthesia Fee Schedule'!E117","v":4},{"$f":"'Anesthesia Fee Schedule'!F117","v":"Base/Time"},{"$f":"'Anesthesia Fee Schedule'!G117","v":"CMS"},{"$f":"'Anesthesia Fee Schedule'!H117","v":"A"},{"$f":"'Anesthesia Fee Schedule'!I117","v":0}]
[{"$f":"SEARCH(Lookup!$J$3,B17)","v":{"$error":"#VALUE!"}},{"$f":"'Anesthesia Fee Schedule'!D118","v":160},{"$f":"'Anesthesia Fee Schedule'!E118","v":5},{"$f":"'Anesthesia Fee Schedule'!F118","v":"Base/Time"},{"$f":"'Anesthesia Fee Schedule'!G118","v":"CMS"},{"$f":"'Anesthesia Fee Schedule'!H118","v":"A"},{"$f":"'Anesthesia Fee Schedule'!I118","v":0}]
[{"$f":"SEARCH(Lookup!$J$3,B18)","v":{"$error":"#VALUE!"}},{"$f":"'Anesthesia Fee Schedule'!D119","v":162},{"$f":"'Anesthesia Fee Schedule'!E119","v":7},{"$f":"'Anesthesia Fee Schedule'!F119","v":"Base/Time"},{"$f":"'Anesthesia Fee Schedule'!G119","v":"CMS"},{"$f":"'Anesthesia Fee Schedule'!H119","v":"A"},{"$f":"'Anesthesia Fee Schedule'!I119","v":0}]
[{"$f":"SEARCH(Lookup!$J$3,B19)","v":{"$error":"#VALUE!"}},{"$f":"'Anesthesia Fee Schedule'!D120","v":164},{"$f":"'Anesthesia Fee Schedule'!E120","v":4},{"$f":"'Anesthesia Fee Schedule'!F120","v":"Base/Time"},{"$f":"'Anesthesia Fee Schedule'!G120","v":"CMS"},{"$f":"'Anesthesia Fee Schedule'!H120","v":"A"},{"$f":"'Anesthesia Fee Schedule'!I120","v":0}]
[{"$f":"SEARCH(Lookup!$J$3,B20)","v":{"$error":"#VALUE!"}},{"$f":"'Anesthesia Fee Schedule'!D121","v":170},{"$f":"'Anesthesia Fee Schedule'!E121","v":5},{"$f":"'Anesthesia Fee Schedule'!F121","v":"Base/Time"},{"$f":"'Anesthesia Fee Schedule'!G121","v":"CMS"},{"$f":"'Anesthesia Fee Schedule'!H121","v":"A"},{"$f":"'Anesthesia Fee Schedule'!I121","v":0}]
[{"$f":"SEARCH(Lookup!$J$3,B21)","v":{"$error":"#VALUE!"}},{"$f":"'Anesthesia Fee Schedule'!D122","v":172},{"$f":"'Anesthesia Fee Schedule'!E122","v":6},{"$f":"'Anesthesia Fee Schedule'!F122","v":"Base/Time"},{"$f":"'Anesthesia Fee Schedule'!G122","v":"CMS"},{"$f":"'Anesthesia Fee Schedule'!H122","v":"A"},{"$f":"'Anesthesia Fee Schedule'!I122","v":0}]
[{"$f":"SEARCH(Lookup!$J$3,B22)","v":{"$error":"#VALUE!"}},{"$f":"'Anesthesia Fee Schedule'!D123","v":174},{"$f":"'Anesthesia Fee Schedule'!E123","v":6},{"$f":"'Anesthesia Fee Schedule'!F123","v":"Base/Time"},{"$f":"'Anesthesia Fee Schedule'!G123","v":"CMS"},{"$f":"'Anesthesia Fee Schedule'!H123","v":"A"},{"$f":"'Anesthesia Fee Schedule'!I123","v":0}]
[{"$f":"SEARCH(Lookup!$J$3,B23)","v":{"$error":"#VALUE!"}},{"$f":"'Anesthesia Fee Schedule'!D124","v":176},{"$f":"'Anesthesia Fee Schedule'!E124","v":7},{"$f":"'Anesthesia Fee Schedule'!F124","v":"Base/Time"},{"$f":"'Anesthesia Fee Schedule'!G124","v":"CMS"},{"$f":"'Anesthesia Fee Schedule'!H124","v":"A"},{"$f":"'Anesthesia Fee Schedule'!I124","v":0}]
[{"$f":"SEARCH(Lookup!$J$3,B24)","v":{"$error":"#VALUE!"}},{"$f":"'Anesthesia Fee Schedule'!D125","v":190},{"$f":"'Anesthesia Fee Schedule'!E125","v":5},{"$f":"'Anesthesia Fee Schedule'!F125","v":"Base/Time"},{"$f":"'Anesthesia Fee Schedule'!G125","v":"CMS"},{"$f":"'Anesthesia Fee Schedule'!H125","v":"A"},{"$f":"'Anesthesia Fee Schedule'!I125","v":0}]
[{"$f":"SEARCH(Lookup!$J$3,B25)","v":{"$error":"#VALUE!"}},{"$f":"'Anesthesia Fee Schedule'!D126","v":192},{"$f":"'Anesthesia Fee Schedule'!E126","v":7},{"$f":"'Anesthesia Fee Schedule'!F126","v":"Base/Time"},{"$f":"'Anesthesia Fee Schedule'!G126","v":"CMS"},{"$f":"'Anesthesia Fee Schedule'!H126","v":"A"},{"$f":"'Anesthesia Fee Schedule'!I126","v":0}]
[{"$f":"SEARCH(Lookup!$J$3,B26)","v":{"$error":"#VALUE!"}},{"$f":"'Anesthesia Fee Schedule'!D127","v":210},{"$f":"'Anesthesia Fee Schedule'!E127","v":11},{"$f":"'Anesthesia Fee Schedule'!F127","v":"Base/Time"},{"$f":"'Anesthesia Fee Schedule'!G127","v":"CMS"},{"$f":"'Anesthesia Fee Schedule'!H127","v":"A"},{"$f":"'Anesthesia Fee Schedule'!I127","v":0}]
[{"$f":"SEARCH(Lookup!$J$3,B27)","v":{"$error":"#VALUE!"}},{"$f":"'Anesthesia Fee Schedule'!D128","v":211},{"$f":"'Anesthesia Fee Schedule'!E128","v":10},{"$f":"'Anesthesia Fee Schedule'!F128","v":"Base/Time"},{"$f":"'Anesthesia Fee Schedule'!G128","v":"CMS"},{"$f":"'Anesthesia Fee Schedule'!H128","v":"A"},{"$f":"'Anesthesia Fee Schedule'!I128","v":0}]
[{"$f":"SEARCH(Lookup!$J$3,B28)","v":{"$error":"#VALUE!"}},{"$f":"'Anesthesia Fee Schedule'!D129","v":212},{"$f":"'Anesthesia Fee Schedule'!E129","v":5},{"$f":"'Anesthesia Fee Schedule'!F129","v":"Base/Time"},{"$f":"'Anesthesia Fee Schedule'!G129","v":"CMS"},{"$f":"'Anesthesia Fee Schedule'!H129","v":"A"},{"$f":"'Anesthesia Fee Schedule'!I129","v":0}]
[{"$f":"SEARCH(Lookup!$J$3,B29)","v":{"$error":"#VALUE!"}},{"$f":"'Anesthesia Fee Schedule'!D130","v":214},{"$f":"'Anesthesia Fee Schedule'!E130","v":9},{"$f":"'Anesthesia Fee Schedule'!F130","v":"Base/Time"},{"$f":"'Anesthesia Fee Schedule'!G130","v":"CMS"},{"$f":"'Anesthesia Fee Schedule'!H130","v":"A"},{"$f":"'Anesthesia Fee Schedule'!I130","v":0}]
[{"$f":"SEARCH(Lookup!$J$3,B30)","v":{"$error":"#VALUE!"}},{"$f":"'Anesthesia Fee Schedule'!D131","v":215},{"$f":"'Anesthesia Fee Schedule'!E131","v":9},{"$f":"'Anesthesia Fee Schedule'!F131","v":"Base/Time"},{"$f":"'Anesthesia Fee Schedule'!G131","v":"CMS"},{"$f":"'Anesthesia Fee Schedule'!H131","v":"A"},{"$f":"'Anesthesia Fee Schedule'!I131","v":0}]
[{"$f":"SEARCH(Lookup!$J$3,B31)","v":{"$error":"#VALUE!"}},{"$f":"'Anesthesia Fee Schedule'!D132","v":216},{"$f":"'Anesthesia Fee Schedule'!E132","v":15},{"$f":"'Anesthesia Fee Schedule'!F132","v":"Base/Time"},{"$f":"'Anesthesia Fee Schedule'!G132","v":"CMS"},{"$f":"'Anesthesia Fee Schedule'!H132","v":"A"},{"$f":"'Anesthesia Fee Schedule'!I132","v":0}]
[{"$f":"SEARCH(Lookup!$J$3,B32)","v":{"$error":"#VALUE!"}},{"$f":"'Anesthesia Fee Schedule'!D133","v":218},{"$f":"'Anesthesia Fee Schedule'!E133","v":13},{"$f":"'Anesthesia Fee Schedule'!F133","v":"Base/Time"},{"$f":"'Anesthesia Fee Schedule'!G133","v":"CMS"},{"$f":"'Anesthesia Fee Schedule'!H133","v":"A"},{"$f":"'Anesthesia Fee Schedule'!I133","v":0}]
[{"$f":"SEARCH(Lookup!$J$3,B33)","v":{"$error":"#VALUE!"}},{"$f":"'Anesthesia Fee Schedule'!D134","v":220},{"$f":"'Anesthesia Fee Schedule'!E134","v":10},{"$f":"'Anesthesia Fee Schedule'!F134","v":"Base/Time"},{"$f":"'Anesthesia Fee Schedule'!G134","v":"CMS"},{"$f":"'Anesthesia Fee Schedule'!H134","v":"A"},{"$f":"'Anesthesia Fee Schedule'!I134","v":0}]
[{"$f":"SEARCH(Lookup!$J$3,B34)","v":{"$error":"#VALUE!"}},{"$f":"'Anesthesia Fee Schedule'!D135","v":222},{"$f":"'Anesthesia Fee Schedule'!E135","v":6},{"$f":"'Anesthesia Fee Schedule'!F135","v":"Base/Time"},{"$f":"'Anesthesia Fee Schedule'!G135","v":"CMS"},{"$f":"'Anesthesia Fee Schedule'!H135","v":"A"},{"$f":"'Anesthesia Fee Schedule'!I135","v":0}]
[{"$f":"SEARCH(Lookup!$J$3,B35)","v":{"$error":"#VALUE!"}},{"$f":"'Anesthesia Fee Schedule'!D136","v":300},{"$f":"'Anesthesia Fee Schedule'!E136","v":5},{"$f":"'Anesthesia Fee Schedule'!F136","v":"Base/Time"},{"$f":"'Anesthesia Fee Schedule'!G136","v":"CMS"},{"$f":"'Anesthesia Fee Schedule'!H136","v":"A"},{"$f":"'Anesthesia Fee Schedule'!I136","v":0}]
[{"$f":"SEARCH(Lookup!$J$3,B36)","v":{"$error":"#VALUE!"}},{"$f":"'Anesthesia Fee Schedule'!D137","v":320},{"$f":"'Anesthesia Fee Schedule'!E137","v":6},{"$f":"'Anesthesia Fee Schedule'!F137","v":"Base/Time"},{"$f":"'Anesthesia Fee Schedule'!G137","v":"CMS"},{"$f":"'Anesthesia Fee Schedule'!H137","v":"A"},{"$f":"'Anesthesia Fee Schedule'!I137","v":0}]
[{"$f":"SEARCH(Lookup!$J$3,B37)","v":{"$error":"#VALUE!"}},{"$f":"'Anesthesia Fee Schedule'!D138","v":322},{"$f":"'Anesthesia Fee Schedule'!E138","v":3},{"$f":"'Anesthesia Fee Schedule'!F138","v":"Base/Time"},{"$f":"'Anesthesia Fee Schedule'!G138","v":"CMS"},{"$f":"'Anesthesia Fee Schedule'!H138","v":"A"},{"$f":"'Anesthesia Fee Schedule'!I138","v":0}]
[{"$f":"SEARCH(Lookup!$J$3,B38)","v":{"$error":"#VALUE!"}},{"$f":"'Anesthesia Fee Schedule'!D139","v":326},{"$f":"'Anesthesia Fee Schedule'!E139","v":0},{"$f":"'Anesthesia Fee Schedule'!F139","v":"Not Covered"},{"$f":"'Anesthesia Fee Schedule'!G139","v":"N/A"},{"$f":"'Anesthesia Fee Schedule'!H139","v":"X"},{"$f":"'Anesthesia Fee Schedule'!I139","v":0}]
[{"$f":"SEARCH(Lookup!$J$3,B39)","v":{"$error":"#VALUE!"}},{"$f":"'Anesthesia Fee Schedule'!D140","v":350},{"$f":"'Anesthesia Fee Schedule'!E140","v":10},{"$f":"'Anesthesia Fee Schedule'!F140","v":"Base/Time"},{"$f":"'Anesthesia Fee Schedule'!G140","v":"CMS"},{"$f":"'Anesthesia Fee Schedule'!H140","v":"A"},{"$f":"'Anesthesia Fee Schedule'!I140","v":0}]
[{"$f":"SEARCH(Lookup!$J$3,B40)","v":{"$error":"#VALUE!"}},{"$f":"'Anesthesia Fee Schedule'!D141","v":352},{"$f":"'Anesthesia Fee Schedule'!E141","v":5},{"$f":"'Anesthesia Fee Schedule'!F141","v":"Base/Time"},{"$f":"'Anesthesia Fee Schedule'!G141","v":"CMS"},{"$f":"'Anesthesia Fee Schedule'!H141","v":"A"},{"$f":"'Anesthesia Fee Schedule'!I141","v":0}]
[{"$f":"SEARCH(Lookup!$J$3,B41)","v":{"$error":"#VALUE!"}},{"$f":"'Anesthesia Fee Schedule'!D142","v":400},{"$f":"'Anesthesia Fee Schedule'!E142","v":3},{"$f":"'Anesthesia Fee Schedule'!F142","v":"Base/Time"},{"$f":"'Anesthesia Fee Schedule'!G142","v":"CMS"},{"$f":"'Anesthesia Fee Schedule'!H142","v":"A"},{"$f":"'Anesthesia Fee Schedule'!I142","v":0}]
[{"$f":"SEARCH(Lookup!$J$3,B42)","v":{"$error":"#VALUE!"}},{"$f":"'Anesthesia Fee Schedule'!D143","v":402},{"$f":"'Anesthesia Fee Schedule'!E143","v":5},{"$f":"'Anesthesia Fee Schedule'!F143","v":"Base/Time"},{"$f":"'Anesthesia Fee Schedule'!G143","v":"CMS"},{"$f":"'Anesthesia Fee Schedule'!H143","v":"A"},{"$f":"'Anesthesia Fee Schedule'!I143","v":0}]
[{"$f":"SEARCH(Lookup!$J$3,B43)","v":{"$error":"#VALUE!"}},{"$f":"'Anesthesia Fee Schedule'!D144","v":404},{"$f":"'Anesthesia Fee Schedule'!E144","v":5},{"$f":"'Anesthesia Fee Schedule'!F144","v":"Base/Time"},{"$f":"'Anesthesia Fee Schedule'!G144","v":"CMS"},{"$f":"'Anesthesia Fee Schedule'!H144","v":"A"},{"$f":"'Anesthesia Fee Schedule'!I144","v":0}]
[{"$f":"SEARCH(Lookup!$J$3,B44)","v":{"$error":"#VALUE!"}},{"$f":"'Anesthesia Fee Schedule'!D145","v":406},{"$f":"'Anesthesia Fee Schedule'!E145","v":13},{"$f":"'Anesthesia Fee Schedule'!F145","v":"Base/Time"},{"$f":"'Anesthesia Fee Schedule'!G145","v":"CMS"},{"$f":"'Anesthesia Fee Schedule'!H145","v":"A"},{"$f":"'Anesthesia Fee Schedule'!I145","v":0}]
[{"$f":"SEARCH(Lookup!$J$3,B45)","v":{"$error":"#VALUE!"}},{"$f":"'Anesthesia Fee Schedule'!D146","v":410},{"$f":"'Anesthesia Fee Schedule'!E146","v":4},{"$f":"'Anesthesia Fee Schedule'!F146","v":"Base/Time"},{"$f":"'Anesthesia Fee Schedule'!G146","v":"CMS"},{"$f":"'Anesthesia Fee Schedule'!H146","v":"A"},{"$f":"'Anesthesia Fee Schedule'!I146","v":0}]
[{"$f":"SEARCH(Lookup!$J$3,B46)","v":{"$error":"#VALUE!"}},{"$f":"'Anesthesia Fee Schedule'!D147","v":450},{"$f":"'Anesthesia Fee Schedule'!E147","v":5},{"$f":"'Anesthesia Fee Schedule'!F147","v":"Base/Time"},{"$f":"'Anesthesia Fee Schedule'!G147","v":"CMS"},{"$f":"'Anesthesia Fee Schedule'!H147","v":"A"},{"$f":"'Anesthesia Fee Schedule'!I147","v":0}]
[{"$f":"SEARCH(Lookup!$J$3,B47)","v":{"$error":"#VALUE!"}},{"$f":"'Anesthesia Fee Schedule'!D148","v":454},{"$f":"'Anesthesia Fee Schedule'!E148","v":3},{"$f":"'Anesthesia Fee Schedule'!F148","v":"Base/Time"},{"$f":"'Anesthesia Fee Schedule'!G148","v":"CMS"},{"$f":"'Anesthesia Fee Schedule'!H148","v":"A"},{"$f":"'Anesthesia Fee Schedule'!I148","v":0}]
[{"$f":"SEARCH(Lookup!$J$3,B48)","v":{"$error":"#VALUE!"}},{"$f":"'Anesthesia Fee Schedule'!D149","v":470},{"$f":"'Anesthesia Fee Schedule'!E149","v":6},{"$f":"'Anesthesia Fee Schedule'!F149","v":"Base/Time"},{"$f":"'Anesthesia Fee Schedule'!G149","v":"CMS"},{"$f":"'Anesthesia Fee Schedule'!H149","v":"A"},{"$f":"'Anesthesia Fee Schedule'!I149","v":0}]
[{"$f":"SEARCH(Lookup!$J$3,B49)","v":{"$error":"#VALUE!"}},{"$f":"'Anesthesia Fee Schedule'!D150","v":472},{"$f":"'Anesthesia Fee Schedule'!E150","v":10},{"$f":"'Anesthesia Fee Schedule'!F150","v":"Base/Time"},{"$f":"'Anesthesia Fee Schedule'!G150","v":"CMS"},{"$f":"'Anesthesia Fee Schedule'!H150","v":"A"},{"$f":"'Anesthesia Fee Schedule'!I150","v":0}]
[{"$f":"SEARCH(Lookup!$J$3,B50)","v":{"$error":"#VALUE!"}},{"$f":"'Anesthesia Fee Schedule'!D151","v":474},{"$f":"'Anesthesia Fee Schedule'!E151","v":13},{"$f":"'Anesthesia Fee Schedule'!F151","v":"Base/Time"},{"$f":"'Anesthesia Fee Schedule'!G151","v":"CMS"},{"$f":"'Anesthesia Fee Schedule'!H151","v":"A"},{"$f":"'Anesthesia Fee Schedule'!I151","v":0}]
[{"$f":"SEARCH(Lookup!$J$3,B51)","v":{"$error":"#VALUE!"}},{"$f":"'Anesthesia Fee Schedule'!D152","v":500},{"$f":"'Anesthesia Fee Schedule'!E152","v":15},{"$f":"'Anesthesia Fee Schedule'!F152","v":"Base/Time"},{"$f":"'Anesthesia Fee Schedule'!G152","v":"CMS"},{"$f":"'Anesthesia Fee Schedule'!H152","v":"A"},{"$f":"'Anesthesia Fee Schedule'!I152","v":0}]
[{"$f":"SEARCH(Lookup!$J$3,B52)","v":{"$error":"#VALUE!"}},{"$f":"'Anesthesia Fee Schedule'!D153","v":520},{"$f":"'Anesthesia Fee Schedule'!E153","v":6},{"$f":"'Anesthesia Fee Schedule'!F153","v":"Base/Time"},{"$f":"'Anesthesia Fee Schedule'!G153","v":"CMS"},{"$f":"'Anesthesia Fee Schedule'!H153","v":"A"},{"$f":"'Anesthesia Fee Schedule'!I153","v":0}]
[{"$f":"SEARCH(Lookup!$J$3,B53)","v":{"$error":"#VALUE!"}},{"$f":"'Anesthesia Fee Schedule'!D154","v":522},{"$f":"'Anesthesia Fee Schedule'!E154","v":4},{"$f":"'Anesthesia Fee Schedule'!F154","v":"Base/Time"},{"$f":"'Anesthesia Fee Schedule'!G154","v":"CMS"},{"$f":"'Anesthesia Fee Schedule'!H154","v":"A"},{"$f":"'Anesthesia Fee Schedule'!I154","v":0}]
[{"$f":"SEARCH(Lookup!$J$3,B54)","v":{"$error":"#VALUE!"}},{"$f":"'Anesthesia Fee Schedule'!D155","v":524},{"$f":"'Anesthesia Fee Schedule'!E155","v":4},{"$f":"'Anesthesia Fee Schedule'!F155","v":"Base/Time"},{"$f":"'Anesthesia Fee Schedule'!G155","v":"CMS"},{"$f":"'Anesthesia Fee Schedule'!H155","v":"A"},{"$f":"'Anesthesia Fee Schedule'!I155","v":0}]
[{"$f":"SEARCH(Lookup!$J$3,B55)","v":{"$error":"#VALUE!"}},{"$f":"'Anesthesia Fee Schedule'!D156","v":528},{"$f":"'Anesthesia Fee Schedule'!E156","v":8},{"$f":"'Anesthesia Fee Schedule'!F156","v":"Base/Time"},{"$f":"'Anesthesia Fee Schedule'!G156","v":"CMS"},{"$f":"'Anesthesia Fee Schedule'!H156","v":"A"},{"$f":"'Anesthesia Fee Schedule'!I156","v":0}]
[{"$f":"SEARCH(Lookup!$J$3,B56)","v":{"$error":"#VALUE!"}},{"$f":"'Anesthesia Fee Schedule'!D157","v":529},{"$f":"'Anesthesia Fee Schedule'!E157","v":0},{"$f":"'Anesthesia Fee Schedule'!F157","v":"Not Covered"},{"$f":"'Anesthesia Fee Schedule'!G157","v":"N/A"},{"$f":"'Anesthesia Fee Schedule'!H157","v":"X"},{"$f":"'Anesthesia Fee Schedule'!I157","v":0}]
[{"$f":"SEARCH(Lookup!$J$3,B57)","v":{"$error":"#VALUE!"}},{"$f":"'Anesthesia Fee Schedule'!D158","v":530},{"$f":"'Anesthesia Fee Schedule'!E158","v":4},{"$f":"'Anesthesia Fee Schedule'!F158","v":"Base/Time"},{"$f":"'Anesthesia Fee Schedule'!G158","v":"CMS"},{"$f":"'Anesthesia Fee Schedule'!H158","v":"A"},{"$f":"'Anesthesia Fee Schedule'!I158","v":0}]
[{"$f":"SEARCH(Lookup!$J$3,B58)","v":{"$error":"#VALUE!"}},{"$f":"'Anesthesia Fee Schedule'!D159","v":532},{"$f":"'Anesthesia Fee Schedule'!E159","v":4},{"$f":"'Anesthesia Fee Schedule'!F159","v":"Base/Time"},{"$f":"'Anesthesia Fee Schedule'!G159","v":"CMS"},{"$f":"'Anesthesia Fee Schedule'!H159","v":"A"},{"$f":"'Anesthesia Fee Schedule'!I159","v":0}]
[{"$f":"SEARCH(Lookup!$J$3,B59)","v":{"$error":"#VALUE!"}},{"$f":"'Anesthesia Fee Schedule'!D160","v":534},{"$f":"'Anesthesia Fee Schedule'!E160","v":7},{"$f":"'Anesthesia Fee Schedule'!F160","v":"Base/Time"},{"$f":"'Anesthesia Fee Schedule'!G160","v":"CMS"},{"$f":"'Anesthesia Fee Schedule'!H160","v":"A"},{"$f":"'Anesthesia Fee Schedule'!I160","v":0}]
[{"$f":"SEARCH(Lookup!$J$3,B60)","v":{"$error":"#VALUE!"}},{"$f":"'Anesthesia Fee Schedule'!D161","v":537},{"$f":"'Anesthesia Fee Schedule'!E161","v":7},{"$f":"'Anesthesia Fee Schedule'!F161","v":"Base/Time"},{"$f":"'Anesthesia Fee Schedule'!G161","v":"CMS"},{"$f":"'Anesthesia Fee Schedule'!H161","v":"A"},{"$f":"'Anesthesia Fee Schedule'!I161","v":0}]
{"$rows_left_out":211}